Timestamp,,,Your close relationship with the deceased. It should be someone you have had a conversation with. The deceased was my ...,Sex of deceased,Age at time of death,"Date of death (must be on or after Dec 1, 2020)","COVID vax status at time of death, e.g., Dose 1 means he had most recently received Dose 1. Do not guess. Leave blank if you don't know.","If vaccinated, how many DAYS AFTER DOSE did the deceased die? (skip if not vaxed)","Cause of death (check ALL that apply). If you don't know, skip this question.","Worsening of a pre-existing fatal condition? As usual, skip if you don't know",Activity at time of death. Skip if you don't know.,Died unexpectedly? Skip if you don't know.,"Number of comorbidities (conditions that put you at higher risk for dying such as over 75 years old, obesity, diabetes, heart disease, cancer, respiratory disease, high blood pressure, autoimmune disease, prion diseases, etc)",Vaccine brand taken (the very FIRST shot). Leave empty if you don't know,Vaccine brand taken (the 2nd shot),Vaccine brand taken (the 3rd shot),Vaccine brand taken (the 4th shot),Country where the death occurred,Postal code of where deceased was currently residing at time of death. Leave blank if you don't know.,BONUS question: Do you think the vaccines are safe and effective? (leave blank if you aren't sure),Thank you so much! Anything else you would like us to know about this death?,
2022/05/15 6:04:08 PM HADT,,,Patient (I'm a healthcare professional),Male,50-60,3/5/2022,NEVER vaccinated with COVID-19 vaccine **AND** had no intention of being vaccinated,,"Bleeding or Clot related (stroke, bleeding in the brain, pulmonary embolism, heart attack, DVT, ...)",,During waking hours but in bed,Yes. Died without any warning. People were surprised.,4,NONE. Deceased never got a COVID vaccine.,NONE (didn't take 2nd SHOT),NONE (didn't take 3rd SHOT),NONE (didn't take 4th SHOT),USA,49508,No,no,The person was never vaccinated with any COVID vaccine
2022/05/15 6:04:34 PM HADT,,,Friend/co-worker,Male,50-60,12/21/2021,Dose 2,,,,,Yes. Died without any warning. People were surprised.,,,,,,USA,22310,No,,
2022/05/15 6:04:34 PM HADT,,,"Family member/relative (either immediate or extended) such as brother, wife, cousin, aunt, father, ...",Female,90+,9/10/2021,Dose 2,4-5 months,,,Sleeping,Yes. Died without any warning. People were surprised.,2,Pfizer,Pfizer,,,USA,95662,No,,
2022/05/15 6:04:51 PM HADT,,,Friend/co-worker,Male,50-60,4/28/2022,Dose 1,8-12 months,"Respiratory related (died on ventilator or on high flow oxygen);COVID-19 infection played a major role in the death;COVID-19;Died in hospital, likely due to how treated in the hospital",,During waking hours but in bed,No. Died after a long illness and was expected to die.,1,Pfizer,NONE (didn't take 2nd SHOT),NONE (didn't take 3rd SHOT),NONE (didn't take 4th SHOT),Canada,K0A,No,"Hospital malpractice. He had Covid (Delta) way back in November 2021, but still needed oxygen due to Covid lung complications. With local power failure mid April 2022, he went into hospital for steady oxygen and to be stabilized. He had no active Covid infection upon entry to hospital and refused the PCR test. He was immuno-compromised (in cancer remission for over a year). They forced a PCR test which came back with a false positive (faint Delta fragments), so they forced him into a room with another active Covid (Omicron) patient despite MANY pleas not to do so. He got Covid from the other patient within a few hours sharing the room and died a few days later in ICU.  ",The vaccine had no noticeable effect on any pre-existing conditions
2022/05/15 6:05:05 PM HADT,,,"Family member/relative (either immediate or extended) such as brother, wife, cousin, aunt, father, ...",Male,90+,9/4/2021,Dose 2,6-7 months,"Heart related (heart attack, cardiac arrest, myocarditis, ...)",,During waking hours sitting,Yes. Died without any warning. People were surprised.,2,Pfizer,Pfizer,NONE (didn't take 3rd SHOT),NONE (didn't take 4th SHOT),USA,2537,No,"He was old, so it is not the best case study, but coincidentally the timing was not terribly long after vaccination.  The 6 months before his death and after vaccination, he had many mental episodes ",
2022/05/15 6:05:32 PM HADT,,,"Family member/relative (either immediate or extended) such as brother, wife, cousin, aunt, father, ...",Female,90+,6/16/2020,Dose 2,3-4 months,"Heart related (heart attack, cardiac arrest, myocarditis, ...)",,During waking hours but in bed,No. Died after a long illness and was expected to die.,2,,,,,USA,13815,No,,"The vaccine seemed to ""accelerate"" a pre-existing condition that caused the death which was fairly well under control at the time of death"
2022/05/15 6:05:42 PM HADT,,,"Family member/relative (either immediate or extended) such as brother, wife, cousin, aunt, father, ...",Male,90+,9/16/2021,NEVER vaccinated with COVID-19 vaccine **AND** had no intention of being vaccinated,,"Died in hospital, likely due to how treated in the hospital",,During waking hours but in bed,,1,NONE. Deceased never got a COVID vaccine.,NONE (didn't take 2nd SHOT),NONE (didn't take 3rd SHOT),NONE (didn't take 4th SHOT),USA,99143,No,I believe my dad's death was primarily due to neglect while in a rehab facility.  He lost 20 pounds in 3 weeks there--and was not overweight when he went in--and due to Covid restrictions I was not able to be with him for 4 of the 6 weeks he was there.,The person was never vaccinated with any COVID vaccine
2022/05/15 6:06:36 PM HADT,,,Friend/co-worker,Female,50-60,9/2/2021,Dose 2,1-2 months,"Died as a result of a condition/disease that first appeared AFTER a COVID vax dose;Bleeding or Clot related (stroke, bleeding in the brain, pulmonary embolism, heart attack, DVT, ...)",,During waking hours standing around,Yes. Died without any warning. People were surprised.,0,Pfizer,Pfizer,NONE (didn't take 3rd SHOT),NONE (didn't take 4th SHOT),Canada,,No,Her husband is convinced that her death was due to the vaccine.  There were no health issues of concern prior.  She had a stoke due to blood clot and was in a coma for several weeks before being taken off life support.  ,The vaccine had no noticeable effect on any pre-existing conditions
2022/05/15 6:07:37 PM HADT,,,Friend/co-worker,Male,50-60,10/28/2021,NEVER vaccinated with COVID-19 vaccine **AND** had no intention of being vaccinated,,"Died in hospital, after getting remdesivir",,,Yes. Died without any warning. People were surprised.,0,,,,,USA,49341,No,Hospital caused.  Family not allowed in to visit,
2022/05/15 6:07:47 PM HADT,,,Other,Female,50-60,5/23/2021,Dose 2,1-2 months,"Heart related (heart attack, cardiac arrest, myocarditis, ...)",,During waking hours but in bed,Yes. Died without any warning. People were surprised.,0,Pfizer,Pfizer,NONE (didn't take 3rd SHOT),NONE (didn't take 4th SHOT),Canada,,No,,
2022/05/15 6:08:06 PM HADT,,,Friend/co-worker,Male,40-50,4/18/2021,Dose 1,Less than 24 hours,"Died as a result of a condition/disease that first appeared AFTER a COVID vax dose;Bleeding or Clot related (stroke, bleeding in the brain, pulmonary embolism, heart attack, DVT, ...)",,Sleeping,Yes. Died without any warning. People were surprised.,0,Pfizer,NONE (didn't take 2nd SHOT),NONE (didn't take 3rd SHOT),NONE (didn't take 4th SHOT),USA,85331,No,,
2022/05/15 6:08:14 PM HADT,,,"Family member/relative (either immediate or extended) such as brother, wife, cousin, aunt, father, ...",Male,90+,1/29/2021,"NEVER vaccinated, but WANTED to be vaccinated but died before he was able to receive his first shot",,"Died in hospital, after getting remdesivir",,,No. Died after a long illness and was expected to die.,1,NONE. Deceased never got a COVID vaccine.,NONE (didn't take 2nd SHOT),NONE (didn't take 3rd SHOT),NONE (didn't take 4th SHOT),USA,,No,"He was moved to a nursing home to die, after 10 day treatment with remdesevir in hospital.  Died within a week.  Kidney failure. Malpractice. ",The person was never vaccinated with any COVID vaccine
2022/05/15 6:08:16 PM HADT,,,"Family member/relative (either immediate or extended) such as brother, wife, cousin, aunt, father, ...",Male,80-90,12/25/2021,Dose 2,8-12 months,"Died as a result of a condition/disease that first appeared AFTER a COVID vax dose;Cancer;Vaccine played a major role (e.g., person was getting progressively worse after the vax)",,During waking hours but in bed,No. Died after a long illness and was expected to die.,2,,,,,USA,40223,No,"My dad had recovered from Larynx cancer 17 yrs. prior, and so he had to be checked for cancer recurrence every year. He was always clear, then he got the vax and the booster. Then sudden aggressive cancer which started in the esophagus. Died Christmas Day. ","The vaccine seemed to ""accelerate"" a pre-existing condition that caused the death which was fairly well under control at the time of death"
2022/05/15 6:09:57 PM HADT,,,"Family member/relative (either immediate or extended) such as brother, wife, cousin, aunt, father, ...",Female,80-90,5/9/2021,NEVER vaccinated with COVID-19 vaccine **AND** had no intention of being vaccinated,,"Died in hospital, likely due to how treated in the hospital",,During waking hours but in bed,No. Died after a long illness and was expected to die.,1,NONE. Deceased never got a COVID vaccine.,,,,USA,92117,No,This death was my mother. I had POA for healthcare for my mother. I would not let the facility where she lived give her the flu shot and definitely NO Covid Vaxx! She died in a skilled nursing facility with dementia and from congestive heart failure. I could not visit her because of the Covid Quarantine rules. She was 89. ,The person was never vaccinated with any COVID vaccine
2022/05/15 6:11:44 PM HADT,,,"Family member/relative (either immediate or extended) such as brother, wife, cousin, aunt, father, ...",Male,50-60,10/17/2021,NEVER vaccinated with COVID-19 vaccine **AND** had no intention of being vaccinated,,"Respiratory related (died on ventilator or on high flow oxygen);COVID-19;Died in hospital, likely due to how treated in the hospital;Died in hospital, after getting remdesivir",,,,,NONE. Deceased never got a COVID vaccine.,NONE (didn't take 2nd SHOT),NONE (didn't take 3rd SHOT),NONE (didn't take 4th SHOT),USA,95603,No,"Death was unexpected in that he wasn’t dying of anything else prior but things went so poorly after the Covid diagnosis (no treatment upon diagnosis, just call us if you can’t breathe) that once hospitalized death seemed to be the expected outcome. Especially once placed on the vent. Bastards killed him on his daughter’s 16th birthday. 😭",The person was never vaccinated with any COVID vaccine
2022/05/15 6:11:59 PM HADT,,,"Family member/relative (either immediate or extended) such as brother, wife, cousin, aunt, father, ...",Male,60-70,1/12/2022,Dose 2,4-5 months,Died as a result of a condition/disease that first appeared AFTER a COVID vax dose;Multiple organ failure,,,,0,,,,,USA,32066,No,,
2022/05/15 6:12:23 PM HADT,,,"Family member/relative (either immediate or extended) such as brother, wife, cousin, aunt, father, ...",Male,50-60,9/20/2021,Dose 2,,"Died as a result of a condition that existed BEFORE they got vaccinated, e.g., Parkinson's disease;Died as a result of a condition/disease that first appeared AFTER a COVID vax dose;COVID-19;Died in hospital, likely due to how treated in the hospital",,,Yes. Died without any warning. People were surprised.,2,,,,,USA,7663,No,He was a 5th year kidney transplant recipient. Was very careful and was doing well until the vaccine. Had to go to hospital for kidney failure (due to vaccine ) hospital said he had Covid upon check in. Said it was ok though. Two days later they said it went to his lungs and he died (was killed )alone overnight ,"The vaccine seemed to ""accelerate"" a pre-existing condition that caused the death which was fairly well under control at the time of death"
2022/05/15 6:13:21 PM HADT,,,"Family member/relative (either immediate or extended) such as brother, wife, cousin, aunt, father, ...",Male,70-80,10/3/2021,NEVER vaccinated with COVID-19 vaccine **AND** had no intention of being vaccinated,,"Heart related (heart attack, cardiac arrest, myocarditis, ...)",,,Yes. Died without any warning. People were surprised.,3,NONE. Deceased never got a COVID vaccine.,NONE (didn't take 2nd SHOT),NONE (didn't take 3rd SHOT),NONE (didn't take 4th SHOT),USA,,No,,The person was never vaccinated with any COVID vaccine
2022/05/15 6:13:56 PM HADT,,,"Family member/relative (either immediate or extended) such as brother, wife, cousin, aunt, father, ...",Male,50-60,3/15/2022,Dose 3,>18 months,"Heart related (heart attack, cardiac arrest, myocarditis, ...)",,Sleeping,Yes. Died without any warning. People were surprised.,4,Pfizer,Pfizer,Pfizer,,USA,96708,Yes,Māui Memorial Hospital is not telling me the whole story of how he died,"The vaccine seemed to ""accelerate"" a pre-existing condition that caused the death which was fairly well under control at the time of death"
2022/05/15 6:14:07 PM HADT,,,"Family member/relative (either immediate or extended) such as brother, wife, cousin, aunt, father, ...",Male,60-70,1/15/2022,NEVER vaccinated with COVID-19 vaccine **AND** had no intention of being vaccinated,,"Multiple organ failure;COVID-19 infection played a major role in the death;Died in hospital, likely due to how treated in the hospital;Died in hospital, after getting remdesivir",,Sleeping,Yes. Died without any warning. People were surprised.,4,NONE. Deceased never got a COVID vaccine.,NONE (didn't take 2nd SHOT),NONE (didn't take 3rd SHOT),NONE (didn't take 4th SHOT),USA,37040,No,,The person was never vaccinated with any COVID vaccine
2022/05/15 6:15:21 PM HADT,,,"Family member/relative (either immediate or extended) such as brother, wife, cousin, aunt, father, ...",Male,70-80,7/24/2021,NEVER vaccinated with COVID-19 vaccine **AND** had no intention of being vaccinated,,"Respiratory related (died on ventilator or on high flow oxygen);Multiple organ failure;Died in hospital, likely due to how treated in the hospital",,During waking hours but in bed,,5,,,,,USA,27235,No,,
2022/05/15 6:15:42 PM HADT,,,Friend/co-worker,Male,80-90,1/13/2021,NEVER vaccinated with COVID-19 vaccine **AND** had no intention of being vaccinated,,COVID-19,,During waking hours but in bed,Yes. Died without any warning. People were surprised.,2,NONE. Deceased never got a COVID vaccine.,NONE (didn't take 2nd SHOT),NONE (didn't take 3rd SHOT),NONE (didn't take 4th SHOT),USA,83864,No,"The deceased, myself, and 10 other people caught COVID from a Christmas party on Dec. 25, 2020. Jim was hospitalized on Jan. 3, 2021 because he was having trouble breathing,  placed on a ventilator and died 10 days later.",The person was never vaccinated with any COVID vaccine
2022/05/15 6:16:45 PM HADT,,,Friend/co-worker,Male,50-60,3/21/2021,NEVER vaccinated with COVID-19 vaccine **AND** had no intention of being vaccinated,,Respiratory related (died on ventilator or on high flow oxygen);COVID-19 infection played a major role in the death;COVID-19,,During waking hours but in bed,Yes. Died without any warning. People were surprised.,3,Moderna,Moderna,NONE (didn't take 3rd SHOT),NONE (didn't take 4th SHOT),USA,,No,"The virus caused pn… the hosp sent him home, he went back and coded 6 times before wife called it. ",The person was never vaccinated with any COVID vaccine
2022/05/15 6:17:13 PM HADT,,,Neighbor,Female,80-90,7/4/2021,Dose 1,2-3 weeks,"Died as a result of a condition that existed BEFORE they got vaccinated, e.g., Parkinson's disease",,During waking hours but in bed,Yes. Died without any warning. People were surprised.,3,Pfizer,,,,USA,10022,No,,"The vaccine seemed to ""accelerate"" a pre-existing condition that caused the death which was fairly well under control at the time of death"
2022/05/15 6:17:36 PM HADT,,,Friend/co-worker,Female,70-80,1/28/2022,Dose 3,1-2 months,Cancer,,During waking hours but in bed,Yes. Died without any warning. People were surprised.,0,,,,,USA,92104,No,My friend was diagnosed with stage 4 lung cancer 3 weeks after the booster.  She died a month later.  She had no prior cancer diagnosis.,The vaccine had no noticeable effect on any pre-existing conditions
2022/05/15 6:18:34 PM HADT,,,"Family member/relative (either immediate or extended) such as brother, wife, cousin, aunt, father, ...",Male,80-90,4/30/2022,Dose 3,,"Bleeding or Clot related (stroke, bleeding in the brain, pulmonary embolism, heart attack, DVT, ...)",,During waking hours walking,Yes. Died without any warning. People were surprised.,,,,,,Canada,,No,Died after dinner....walking to the couch....fell and never got up....died instantly.....already dead by the time ambulance arrived,"The vaccine seemed to ""accelerate"" a pre-existing condition that caused the death which was fairly well under control at the time of death"
2022/05/15 6:18:58 PM HADT,,,Friend/co-worker,Male,50-60,6/21/2021,Dose 1,2-3 weeks,Died as a result of a condition/disease that first appeared AFTER a COVID vax dose,,,Yes. Died without any warning. People were surprised.,0,J&J / Janssen,,,,USA,77429,No,"Dimitri was a former navy F/A-18 pilot friend of mine and fellow airline pilot for United Airlines, which I also fly for.  He took the shot in response to a coercive company-directed incentive that paid him thousands of dollars for getting the shot, but that also threatened to potentially reduce his pay if he didn't take it.  The company would go on to mandate the shot for ALL employees on 06 August 2021.  I refused the shot and, along with about 2200 other employees, was placed on indefinite unpaid leave.  According to a conversation I had with Dimitri's wife, he supposedly died of a rapidly-growing brain tumor, which I find extremely hard to believe as he'd literally been flying airplanes till just a few weeks before he died.  Also, his death occurred just a few weeks after the shot.",
2022/05/15 6:19:15 PM HADT,,,Other,Female,70-80,10/11/2021,NEVER vaccinated with COVID-19 vaccine **AND** had no intention of being vaccinated,,"Multiple organ failure;COVID-19 infection played a major role in the death;COVID-19;Died in hospital, likely due to how treated in the hospital;Died in hospital, after getting remdesivir",,During waking hours but in bed,,2,NONE. Deceased never got a COVID vaccine.,,,,USA,Houston Texas,No,,The person was never vaccinated with any COVID vaccine
2022/05/15 6:20:12 PM HADT,,,Friend/co-worker,Male,80-90,1/20/1938,Dose 3,3-4 months,"Died as a result of a condition/disease that first appeared AFTER a COVID vax dose;Cancer;Heart related (heart attack, cardiac arrest, myocarditis, ...);Bleeding or Clot related (stroke, bleeding in the brain, pulmonary embolism, heart attack, DVT, ...)",,"Doing something stressful that increases heart rate such as running, sports, weightlifting, etc.",No. Died after a long illness and was expected to die.,0,Pfizer,Pfizer,Pfizer,,USA,46815,No,Very sudden leukemia followed by a stroke and then heart failure. Most healthy octogenarian I’ve ever known. ,"The vaccine seemed to ""accelerate"" a pre-existing condition that caused the death which was fairly well under control at the time of death"
2022/05/15 6:20:12 PM HADT,,,Friend/co-worker,Female,60-70,8/7/2022,NEVER vaccinated with COVID-19 vaccine **AND** had no intention of being vaccinated,,"COVID-19 infection played a major role in the death;Died in hospital, likely due to how treated in the hospital",,During waking hours but in bed,No. Died after a long illness and was expected to die.,2,NONE. Deceased never got a COVID vaccine.,NONE (didn't take 2nd SHOT),NONE (didn't take 3rd SHOT),NONE (didn't take 4th SHOT),USA,,No,,The person was never vaccinated with any COVID vaccine
2022/05/15 6:20:17 PM HADT,,,Patient (I'm a healthcare professional),Male,90+,3/24/2021,Dose 1,1 - 2 weeks,,,,Yes. Died without any warning. People were surprised.,,Astra Zeneca,,,,Australia,3806,No,Yes my uncle had just got thru Covid with no continuing symptoms before they vaccinated him,The vaccine had no noticeable effect on any pre-existing conditions
2022/05/15 6:21:01 PM HADT,,,"Family member/relative (either immediate or extended) such as brother, wife, cousin, aunt, father, ...",Female,80-90,3/7/2021,Dose 2,2-3 weeks,"Heart related (heart attack, cardiac arrest, myocarditis, ...)",,During waking hours sitting,Yes. Died without any warning. People were surprised.,1,,,,,USA,98119,No,,
2022/05/15 6:21:36 PM HADT,,,Friend/co-worker,Female,60-70,3/31/2021,Dose 2,1-2 months,"Bleeding or Clot related (stroke, bleeding in the brain, pulmonary embolism, heart attack, DVT, ...)",,,Yes. Died without any warning. People were surprised.,2,Moderna,Moderna,,,USA,33462,No,A nurse mandated to take the shot,
2022/05/15 6:22:41 PM HADT,,,Friend/co-worker,Male,60-70,1/11/2022,NEVER vaccinated with COVID-19 vaccine **AND** had no intention of being vaccinated,,Respiratory related (died on ventilator or on high flow oxygen),,Sleeping,No. Died after a long illness and was expected to die.,2,NONE. Deceased never got a COVID vaccine.,NONE (didn't take 2nd SHOT),NONE (didn't take 3rd SHOT),NONE (didn't take 4th SHOT),USA,83536,No,Died with/from covid but had severe lung scarring from smoke inhalation,The person was never vaccinated with any COVID vaccine
2022/05/15 6:24:15 PM HADT,,,Other,Female,19-Dec,3/6/2022,Dose 2,,"Died in hospital, likely due to how treated in the hospital",,,Yes. Died without any warning. People were surprised.,0,,,,,USA,80026,No,Her obituary is here: https://www.inmemoriamservices.com/obituary/Emma-Stephan?fbclid=IwAR0eE6YBEgjlJN8SwGA-p7p99ZZ7q-a95KjzySIEs-G4Z-ZMwpJApqYV2Ug,
2022/05/15 6:25:06 PM HADT,,,Friend/co-worker,Male,60-70,4/2/2022,,,"Bleeding or Clot related (stroke, bleeding in the brain, pulmonary embolism, heart attack, DVT, ...)",,,Yes. Died without any warning. People were surprised.,,,,,,USA,83536,No,Don't know if he was vaccinated,
2022/05/15 6:26:08 PM HADT,,,Friend/co-worker,Male,40-50,8/19/2021,Dose 2,1-2 months,"Heart related (heart attack, cardiac arrest, myocarditis, ...)",,Sleeping,Yes. Died without any warning. People were surprised.,1,,,,,Canada,V3T 5A1,No,,The vaccine had no noticeable effect on any pre-existing conditions
2022/05/15 6:26:48 PM HADT,,,Friend/co-worker,Female,40-50,10/5/2021,Dose 2,3-4 months,"Died as a result of a condition that existed BEFORE they got vaccinated, e.g., Parkinson's disease",,,Yes. Died without any warning. People were surprised.,0,Pfizer,Pfizer,,,USA,33470,No,Died of an infection  post shoulder surgery,"The vaccine seemed to ""accelerate"" a pre-existing condition that caused the death which was fairly well under control at the time of death"
2022/05/15 6:26:48 PM HADT,,,"Family member/relative (either immediate or extended) such as brother, wife, cousin, aunt, father, ...",Female,70-80,7/26/2021,Dose 1,2-3 months,"Died as a result of a condition that existed BEFORE they got vaccinated, e.g., Parkinson's disease;Cancer",,During waking hours but in bed,No. Died after a long illness and was expected to die.,4,,,,,USA,79764,No,,"The vaccine seemed to ""accelerate"" a pre-existing condition that caused the death which was fairly well under control at the time of death"